Reaction Details
TargetAlpha-1A adrenergic receptor
LigandBDBM50068819
Substrate/Competitorn/a
Meas. Tech.ChEBML_33730
Ki 3.6±n/a nM
Citation Patane, MADiPardo, RMNewton, RCPrice, RPBroten, TPChang, RSRansom, RWDi Salvo, JNagarathnam, DForray, CGluchowski, CBock, MG Phenylacetamides as selective alpha-1A adrenergic receptor antagonists. Bioorg Med Chem Lett10:1621-4 (2000) Alpha-1A adrenergic receptor
Name:Alpha-1A adrenergic receptor
Type:Cell-surface receptors
Mol. Mass.:51511.67
Organism:Homo sapiens (Human)
Description:P35348
Residue:466
BDBM50068819
NameBDBM50068819
Synonyms:5-[3-(4-Methoxycarbonyl-4-phenyl-piperidin-1-yl)-propylcarbamoyl]-2,6-dimethyl-4-(4-nitro-phenyl)-1,4-dihydro-pyridine-3-carboxylic acid methyl ester | CHEMBL41844
TypeSmall organic molecule
Emp. Form.C32H38N4O7
Mol. Mass.590.6667
SMILESCOC(=O)C1C(C(C(=O)NCCCN2CCC(CC2)(C(=O)OC)c2ccccc2)=C(C)N=C1C)c1ccc(cc1)[N+]([O-])=O