Reaction Details
TargetAlpha-1B adrenergic receptor
LigandBDBM50090325
Substrate/Competitorn/a
Meas. Tech.ChEBML_34344
Ki 34±n/a nM
Citation Patane, MADiPardo, RMNewton, RCPrice, RPBroten, TPChang, RSRansom, RWDi Salvo, JNagarathnam, DForray, CGluchowski, CBock, MG Phenylacetamides as selective alpha-1A adrenergic receptor antagonists. Bioorg Med Chem Lett10:1621-4 (2000) Alpha-1B adrenergic receptor
Name:Alpha-1B adrenergic receptor
Type:Enzyme
Mol. Mass.:56862.13
Organism:Homo sapiens (Human)
Description:P35368
Residue:520
BDBM50090325
NameBDBM50090325
Synonyms:CHEMBL295304 | N-[3-(4-Phenyl-piperidin-1-yl)-propyl]-2,2-di-p-tolyl-acetamide
TypeSmall organic molecule
Emp. Form.C30H36N2O
Mol. Mass.440.6196
SMILESCc1ccc(cc1)C(C(=O)NCCCN1CCC(CC1)c1ccccc1)c1ccc(C)cc1