Reaction Details
TargetAlpha-1A adrenergic receptor
LigandBDBM50090338
Substrate/Competitorn/a
Meas. Tech.ChEBML_34181
Ki 1±n/a nM
Citation Nantermet, PGBarrow, JCSelnick, HGHomnick, CFFreidinger, RMChang, RSO'Malley, SSReiss, DRBroten, TPRansom, RWPettibone, DJOlah, TForray, C Selective alpha1a adrenergic receptor antagonists based on 4-aryl-3,4-dihydropyridine-2-ones. Bioorg Med Chem Lett10:1625-8 (2000) Alpha-1A adrenergic receptor
Name:Alpha-1A adrenergic receptor
Type:Cell-surface receptors
Mol. Mass.:51511.67
Organism:Homo sapiens (Human)
Description:P35348
Residue:466
BDBM50090338
NameBDBM50090338
Synonyms:(R)-4-(3,4-Difluoro-phenyl)-2-methyl-6-oxo-1,4,5,6-tetrahydro-pyridine-3-carboxylic acid {3-[4-cyano-4-(2,4-difluoro-phenyl)-piperidin-1-yl]-propyl}-amide | CHEMBL295001
TypeSmall organic molecule
Emp. Form.C28H28F4N4O2
Mol. Mass.528.5411
SMILESCC1=C([C@H](CC(=O)N1)c1ccc(F)c(F)c1)C(=O)NCCCN1CCC(CC1)(C#N)c1ccc(F)cc1F