Reaction Details
TargetAlpha-2C adrenergic receptor
LigandBDBM50090326
Substrate/Competitorn/a
Meas. Tech.ChEBML_33674
Ki 1905±n/a nM
Citation Nantermet, PGBarrow, JCSelnick, HGHomnick, CFFreidinger, RMChang, RSO'Malley, SSReiss, DRBroten, TPRansom, RWPettibone, DJOlah, TForray, C Selective alpha1a adrenergic receptor antagonists based on 4-aryl-3,4-dihydropyridine-2-ones. Bioorg Med Chem Lett10:1625-8 (2000) Alpha-2C adrenergic receptor
Name:Alpha-2C adrenergic receptor
Type:Enzyme
Mol. Mass.:49552.32
Organism:Homo sapiens (Human)
Description:P18825
Residue:462
BDBM50090326
NameBDBM50090326
Synonyms:(R)-4-(3,4-Difluoro-phenyl)-1,2-dimethyl-6-oxo-1,4,5,6-tetrahydro-pyridine-3-carboxylic acid {3-[4-cyano-4-(2,4-difluoro-phenyl)-piperidin-1-yl]-propyl}-amide | CHEMBL295395
TypeSmall organic molecule
Emp. Form.C29H30F4N4O2
Mol. Mass.542.5677
SMILESCN1C(=O)C[C@@H](C(C(=O)NCCCN2CCC(CC2)(C#N)c2ccc(F)cc2F)=C1C)c1ccc(F)c(F)c1