Reaction Details
TargetD(1A) dopamine receptor
LigandBDBM50090489
Substrate/Competitorn/a
Meas. Tech.ChEBML_58797
Ki 174840±n/a nM
Citation Kawai, HKotake, YOhta, S Inhibition of dopamine receptors by endogenous amines: binding to striatal receptors and pharmacological effects on locomotor activity. Bioorg Med Chem Lett10:1669-71 (2000) D(1A) dopamine receptor
Name:D(1A) dopamine receptor
Type:Enzyme Catalytic Domain
Mol. Mass.:49429.75
Organism:RAT
Description:P18901
Residue:446
BDBM50090489
NameBDBM50090489
Synonyms:4-(1,2,3,4-Tetrahydro-isoquinolin-1-ylmethyl)-benzene-1,2-diol | CHEMBL44877
TypeSmall organic molecule
Emp. Form.C16H17NO2
Mol. Mass.255.3117
SMILESOc1ccc(CC2NCCc3ccccc23)cc1O