Reaction Details
TargetCoagulation factor X
LigandBDBM50090597
Substrate/Competitorn/a
Meas. Tech.ChEBML_48997
Ki 140±n/a nM
Citation He, WHanney, BMyers, MRSpada, APBrown, KColussi, DChu, V Nonbenzamidine compounds as selective factor Xa inhibitors. Bioorg Med Chem Lett10:1737-9 (2000) Coagulation factor X
Name:Coagulation factor X
Type:Enzyme
Mol. Mass.:54726.60
Organism:Homo sapiens (Human)
Description:n/a
Residue:488
BDBM50090597
NameBDBM50090597
Synonyms:2-[4-(6-Chloro-benzo[b]thiophene-2-sulfonyl)-2-oxo-piperazin-1-yl]-N-(2-pyridin-2-yl-ethyl)-acetamide | CHEMBL299614
TypeSmall organic molecule
Emp. Form.C21H21ClN4O4S2
Mol. Mass.492.999
SMILESClc1ccc2cc(sc2c1)S(=O)(=O)N1CCN(CC(=O)NCCc2ccccn2)C(=O)C1