Reaction Details
TargetCoagulation factor X
LigandBDBM50090603
Substrate/Competitorn/a
Meas. Tech.ChEBML_48997
Ki 620±n/a nM
Citation He, WHanney, BMyers, MRSpada, APBrown, KColussi, DChu, V Nonbenzamidine compounds as selective factor Xa inhibitors. Bioorg Med Chem Lett10:1737-9 (2000) Coagulation factor X
Name:Coagulation factor X
Type:Enzyme
Mol. Mass.:54726.60
Organism:Homo sapiens (Human)
Description:n/a
Residue:488
BDBM50090603
NameBDBM50090603
Synonyms:CHEMBL295515 | N-[2-(2-Amino-thiazol-4-yl)-ethyl]-2-[4-(6-chloro-benzo[b]thiophene-2-sulfonyl)-2-oxo-piperazin-1-yl]-acetamide
TypeSmall organic molecule
Emp. Form.C19H20ClN5O4S3
Mol. Mass.514.041
SMILESNc1nc(CCNC(=O)CN2CCN(CC2=O)S(=O)(=O)c2cc3ccc(Cl)cc3s2)cs1