Reaction Details
TargetCoagulation factor X
LigandBDBM50090609
Substrate/Competitorn/a
Meas. Tech.ChEBML_48997
Ki 430±n/a nM
Citation He, WHanney, BMyers, MRSpada, APBrown, KColussi, DChu, V Nonbenzamidine compounds as selective factor Xa inhibitors. Bioorg Med Chem Lett10:1737-9 (2000) Coagulation factor X
Name:Coagulation factor X
Type:Enzyme
Mol. Mass.:54726.60
Organism:Homo sapiens (Human)
Description:n/a
Residue:488
BDBM50090609
NameBDBM50090609
Synonyms:2-[4-(6-Chloro-benzo[b]thiophene-2-sulfonyl)-2-oxo-piperazin-1-yl]-N-[2-(1-methyl-1H-imidazol-4-yl)-ethyl]-acetamide | CHEMBL49509
TypeSmall organic molecule
Emp. Form.C20H22ClN5O4S2
Mol. Mass.496.003
SMILESCn1cnc(CCNC(=O)CN2CCN(CC2=O)S(=O)(=O)c2cc3ccc(Cl)cc3s2)c1