Reaction Details
Target5-hydroxytryptamine receptor 2A
LigandBDBM50090647
Substrate/Competitorn/a
Meas. Tech.ChEMBL_2295 (CHEMBL617080)
Ki>500±n/a nM
Citation Lagu, BTian, DJeon, YLi, CWetzel, JMNagarathnam, DShen, QForray, CChang, RSBroten, TPRansom, RWChan, TBO'Malley, SSSchorn, TWRodrigues, ADKassahun, KPettibone, DJFreidinger, ROGluchowski, C De novo design of a novel oxazolidinone analogue as a potent and selective alpha1A adrenergic receptor antagonist with high oral bioavailability. J Med Chem43:2775-8 (2000) 5-hydroxytryptamine receptor 2A
Name:5-hydroxytryptamine receptor 2A
Type:undefined
Mol. Mass.:52607.65
Organism:Homo sapiens (Human)
Description:P28223
Residue:471
BDBM50090647
NameBDBM50090647
Synonyms:(4S,5S)-4-(3,4-Difluoro-phenyl)-5-methyl-2-oxo-oxazolidine-3-carboxylic acid {3-[4-(4-fluoro-phenyl)-piperidin-1-yl]-propyl}-amide 4-(3,4-Difluoro-phenyl)-5-methyl-2-oxo-oxazolidine-3-carboxylic acid {3-[4-(4-fluoro-phenyl)-piperidin-1-yl]-propyl}-amide SNAP-7915
TypeSmall organic molecule
Emp. Form.C25H28F3N3O3
Mol. Mass.475.5033
SMILESC[C@@H]1OC(=O)N([C@H]1c1ccc(F)c(F)c1)C(=O)NCCCN1CCC(CC1)c1ccc(F)cc1