Reaction Details
TargetCytochrome P450 2C9
LigandBDBM50090667
Substrate/Competitorn/a
Meas. Tech.ChEMBL_51551 (CHEMBL840930)
Ki 2000±n/a nM
Citation Rao, SAoyama, RSchrag, MTrager, WFRettie, AJones, JP A refined 3-dimensional QSAR of cytochrome P450 2C9: computational predictions of drug interactions. J Med Chem43:2789-96 (2000) Cytochrome P450 2C9
Name:Cytochrome P450 2C9
Type:Enzyme
Mol. Mass.:55636.33
Organism:Homo sapiens (Human)
Description:P11712
Residue:490
BDBM50090667
NameBDBM50090667
Synonyms:CHEMBL96214 | N-(2-Phenyl-2H-pyrazol-3-yl)-benzenesulfonamide
TypeSmall organic molecule
Emp. Form.C15H13N3O2S
Mol. Mass.299.348
SMILESO=S(=O)(Nc1ccnn1-c1ccccc1)c1ccccc1