Reaction Details
TargetCytochrome P450 2C9
LigandBDBM50090670
Substrate/Competitorn/a
Meas. Tech.ChEMBL_51551 (CHEMBL840930)
Ki 2400±n/a nM
Citation Rao, SAoyama, RSchrag, MTrager, WFRettie, AJones, JP A refined 3-dimensional QSAR of cytochrome P450 2C9: computational predictions of drug interactions. J Med Chem43:2789-96 (2000) Cytochrome P450 2C9
Name:Cytochrome P450 2C9
Type:Enzyme
Mol. Mass.:55636.33
Organism:Homo sapiens (Human)
Description:P11712
Residue:490
BDBM50090670
NameBDBM50090670
Synonyms:4-Acetyl-N-(2-phenyl-2H-pyrazol-3-yl)-benzenesulfonamide | CHEMBL93714
TypeSmall organic molecule
Emp. Form.C17H15N3O3S
Mol. Mass.341.384
SMILESCC(=O)c1ccc(cc1)S(=O)(=O)Nc1ccnn1-c1ccccc1