Reaction Details
TargetCytochrome P450 2C9
LigandBDBM50408930
Substrate/Competitorn/a
Meas. Tech.ChEMBL_51549 (CHEMBL661223)
Ki 100±n/a nM
Citation Rao, SAoyama, RSchrag, MTrager, WFRettie, AJones, JP A refined 3-dimensional QSAR of cytochrome P450 2C9: computational predictions of drug interactions. J Med Chem43:2789-96 (2000) Cytochrome P450 2C9
Name:Cytochrome P450 2C9
Type:Enzyme
Mol. Mass.:55636.33
Organism:Homo sapiens (Human)
Description:P11712
Residue:490
BDBM50408930
NameBDBM50408930
Synonyms:CHEMBL2115266
TypeSmall organic molecule
Emp. Form.C19H18O4
Mol. Mass.310.3438
SMILESC[C@@H](O)C[C@@H](c1ccccc1)c1c(O)c2ccccc2oc1=O