Reaction Details
TargetAdenosine kinase
LigandBDBM50090875
Substrate/Competitorn/a
Meas. Tech.ChEMBL_31116 (CHEMBL643544)
IC50 1.2±n/a nM
Citation Ugarkar, BGCastellino, AJDaRe, JMKopcho, JJWiesner, JBSchanzer, JMErion, MD Adenosine kinase inhibitors. 2. Synthesis, enzyme inhibition, and antiseizure activity of diaryltubercidin analogues. J Med Chem43:2894-905 (2000) Adenosine kinase
Name:Adenosine kinase
Type:PROTEIN
Mol. Mass.:40545.97
Organism:Homo sapiens (Human)
Description:ChEMBL_1467841
Residue:362
BDBM50090875
NameBDBM50090875
Synonyms:2-[5-(4-Chloro-phenyl)-4-phenylamino-pyrrolo[2,3-d]pyrimidin-7-yl]-5-methyl-tetrahydro-furan-3,4-diol | CHEMBL318918
TypeSmall organic molecule
Emp. Form.C23H21ClN4O3
Mol. Mass.436.891
SMILESC[C@H]1O[C@H]([C@H](O)[C@@H]1O)n1cc(-c2ccc(Cl)cc2)c2c(Nc3ccccc3)ncnc12