Reaction Details
TargetAdenosine kinase
LigandBDBM50090881
Substrate/Competitorn/a
Meas. Tech.ChEMBL_31116 (CHEMBL643544)
IC50 1±n/a nM
Citation Ugarkar, BGCastellino, AJDaRe, JMKopcho, JJWiesner, JBSchanzer, JMErion, MD Adenosine kinase inhibitors. 2. Synthesis, enzyme inhibition, and antiseizure activity of diaryltubercidin analogues. J Med Chem43:2894-905 (2000) Adenosine kinase
Name:Adenosine kinase
Type:PROTEIN
Mol. Mass.:40545.97
Organism:Homo sapiens (Human)
Description:ChEMBL_1467841
Residue:362
BDBM50090881
NameBDBM50090881
Synonyms:(2R,3R,4S,5R)-2-(6-Bromo-5-phenyl-4-phenylamino-pyrrolo[2,3-d]pyrimidin-7-yl)-5-methyl-tetrahydro-furan-3,4-diol CHEMBL328826
TypeSmall organic molecule
Emp. Form.C23H21BrN4O3
Mol. Mass.481.342
SMILESC[C@H]1O[C@H]([C@H](O)[C@@H]1O)n1c(Br)c(-c2ccccc2)c2c(Nc3ccccc3)ncnc12