Reaction Details
TargetAdenosine kinase
LigandBDBM50090900
Substrate/Competitorn/a
Meas. Tech.ChEMBL_31116 (CHEMBL643544)
IC50 1.5±n/a nM
Citation Ugarkar, BGCastellino, AJDaRe, JMKopcho, JJWiesner, JBSchanzer, JMErion, MD Adenosine kinase inhibitors. 2. Synthesis, enzyme inhibition, and antiseizure activity of diaryltubercidin analogues. J Med Chem43:2894-905 (2000) Adenosine kinase
Name:Adenosine kinase
Type:PROTEIN
Mol. Mass.:40545.97
Organism:Homo sapiens (Human)
Description:ChEMBL_1467841
Residue:362
BDBM50090900
NameBDBM50090900
Synonyms:2-Azidomethyl-5-(5-phenyl-4-phenylamino-pyrrolo[2,3-d]pyrimidin-7-yl)-tetrahydro-furan-3,4-diol | CHEMBL98867
TypeSmall organic molecule
Emp. Form.C23H21N7O3
Mol. Mass.443.4579
SMILESO[C@@H]1[C@@H](CN=[N+]=[N-])O[C@H]([C@@H]1O)n1cc(-c2ccccc2)c2c(Nc3ccccc3)ncnc12