Reaction Details
TargetEctonucleotide pyrophosphatase/phosphodiesterase family member 2
LigandBDBM50535214
Substrate/Competitorn/a
Meas. Tech.ChEMBL_1929986 (CHEMBL4433162)
IC50 2.5±n/a nM
Citation Jones, SBPfeifer, LABleisch, TJBeauchamp, TJDurbin, JDKlimkowski, VJHughes, NERito, CJDao, YGruber, JMBui, HChambers, MGChandrasekhar, SLin, CMcCann, DJMudra, DROskins, JLSwearingen, CAThirunavukkarasu, KNorman, BH Novel Autotaxin Inhibitors for the Treatment of Osteoarthritis Pain: Lead Optimization via Structure-Based Drug Design. ACS Med Chem Lett7:857-61 (2016) 
 
Ectonucleotide pyrophosphatase/phosphodiesterase family member 2
Name:Ectonucleotide pyrophosphatase/phosphodiesterase family member 2
Type:Enzyme
Mol. Mass.:99007.13
Organism:Homo sapiens (Human)
Description:Q13822
Residue:863
BDBM50535214
NameBDBM50535214
Synonyms:CHEMBL4549771
TypeSmall organic molecule
Emp. Form.C26H25N5O3
Mol. Mass.455.5084
SMILESO=C(CCN1CCc2nc(NC3Cc4ccccc4C3)ncc2C1)c1ccc2[nH]c(=O)oc2c1