Reaction Details
TargetEctonucleotide pyrophosphatase/phosphodiesterase family member 2
LigandBDBM50535210
Substrate/Competitorn/a
Meas. Tech.ChEMBL_1929987 (CHEMBL4433163)
IC50 2.2±n/a nM
Citation Jones, SBPfeifer, LABleisch, TJBeauchamp, TJDurbin, JDKlimkowski, VJHughes, NERito, CJDao, YGruber, JMBui, HChambers, MGChandrasekhar, SLin, CMcCann, DJMudra, DROskins, JLSwearingen, CAThirunavukkarasu, KNorman, BH Novel Autotaxin Inhibitors for the Treatment of Osteoarthritis Pain: Lead Optimization via Structure-Based Drug Design. ACS Med Chem Lett7:857-61 (2016) 
 
Ectonucleotide pyrophosphatase/phosphodiesterase family member 2
Name:Ectonucleotide pyrophosphatase/phosphodiesterase family member 2
Type:Enzyme
Mol. Mass.:99007.13
Organism:Homo sapiens (Human)
Description:Q13822
Residue:863
BDBM50535210
NameBDBM50535210
Synonyms:CHEMBL4448598
TypeSmall organic molecule
Emp. Form.C21H23N7O2
Mol. Mass.405.453
SMILESO=C(COCCc1c[nH]nn1)N1Cc2cnc(NC3Cc4ccccc4C3)nc2C1