Reaction Details
TargetAcyl-CoA (8-3)-desaturase
LigandBDBM50535222
Substrate/Competitorn/a
Meas. Tech.ChEMBL_1929998 (CHEMBL4433174)
IC50 1.9±n/a nM
Citation Miyahisa, ISuzuki, HMizukami, ATanaka, YOno, MHixon, MSMatsui, J T-3364366 Targets the Desaturase Domain of Delta-5 Desaturase with Nanomolar Potency and a Multihour Residence Time. ACS Med Chem Lett7:868-72 (2016) 
 
Acyl-CoA (8-3)-desaturase
Name:Acyl-CoA (8-3)-desaturase
Type:PROTEIN
Mol. Mass.:51985.80
Organism:Homo sapiens (Human)
Description:ChEMBL_1513296
Residue:444
BDBM50535222
NameBDBM50535222
Synonyms:CHEMBL4439992
TypeSmall organic molecule
Emp. Form.C18H16F3N3O3S2
Mol. Mass.443.463
SMILESCC(=O)NCCSc1nc2cscc2c(=O)n1-c1ccc(OCC(F)(F)F)cc1