Reaction Details
TargetAcyl-CoA (8-3)-desaturase
LigandBDBM50116708
Substrate/Competitorn/a
Meas. Tech.ChEMBL_1929999 (CHEMBL4433175)
IC50 26±n/a nM
Citation Miyahisa, ISuzuki, HMizukami, ATanaka, YOno, MHixon, MSMatsui, J T-3364366 Targets the Desaturase Domain of Delta-5 Desaturase with Nanomolar Potency and a Multihour Residence Time. ACS Med Chem Lett7:868-72 (2016) 
 
Acyl-CoA (8-3)-desaturase
Name:Acyl-CoA (8-3)-desaturase
Type:PROTEIN
Mol. Mass.:52505.96
Organism:Rattus norvegicus
Description:ChEMBL_852948
Residue:447
BDBM50116708
NameBDBM50116708
Synonyms:CHEMBL2263368
TypeSmall organic molecule
Emp. Form.C13H11ClN2O
Mol. Mass.246.692
SMILESNc1ccccc1C(=O)Nc1cccc(Cl)c1