Reaction Details
TargetAcyl-CoA (8-3)-desaturase
LigandBDBM50116708
Substrate/Competitorn/a
Meas. Tech.ChEMBL_1929998 (CHEMBL4433174)
IC50 29±n/a nM
Citation Miyahisa, ISuzuki, HMizukami, ATanaka, YOno, MHixon, MSMatsui, J T-3364366 Targets the Desaturase Domain of Delta-5 Desaturase with Nanomolar Potency and a Multihour Residence Time. ACS Med Chem Lett7:868-72 (2016) 
 
Acyl-CoA (8-3)-desaturase
Name:Acyl-CoA (8-3)-desaturase
Type:PROTEIN
Mol. Mass.:51985.80
Organism:Homo sapiens (Human)
Description:ChEMBL_1513296
Residue:444
BDBM50116708
NameBDBM50116708
Synonyms:CHEMBL2263368
TypeSmall organic molecule
Emp. Form.C13H11ClN2O
Mol. Mass.246.692
SMILESNc1ccccc1C(=O)Nc1cccc(Cl)c1