Reaction Details
TargetAcyl-CoA (8-3)-desaturase
LigandBDBM50535222
Substrate/Competitorn/a
Meas. Tech.ChEMBL_1929999 (CHEMBL4433175)
IC50 2.1±n/a nM
Citation Miyahisa, ISuzuki, HMizukami, ATanaka, YOno, MHixon, MSMatsui, J T-3364366 Targets the Desaturase Domain of Delta-5 Desaturase with Nanomolar Potency and a Multihour Residence Time. ACS Med Chem Lett7:868-72 (2016) 
 
Acyl-CoA (8-3)-desaturase
Name:Acyl-CoA (8-3)-desaturase
Type:PROTEIN
Mol. Mass.:52505.96
Organism:Rattus norvegicus
Description:ChEMBL_852948
Residue:447
BDBM50535222
NameBDBM50535222
Synonyms:CHEMBL4439992
TypeSmall organic molecule
Emp. Form.C18H16F3N3O3S2
Mol. Mass.443.463
SMILESCC(=O)NCCSc1nc2cscc2c(=O)n1-c1ccc(OCC(F)(F)F)cc1