Reaction Details
TargetSodium-dependent serotonin transporter
LigandBDBM50091098
Substrate/Competitorn/a
Meas. Tech.ChEMBL_201480 (CHEMBL804589)
Ki 0.33±n/a nM
Citation Wilson, AAGinovart, NSchmidt, MMeyer, JHThrelkeld, PGHoule, S Novel radiotracers for imaging the serotonin transporter by positron emission tomography: synthesis, radiosynthesis, and in vitro and ex vivo evaluation of (11)C-labeled 2-(phenylthio)araalkylamines. J Med Chem43:3103-10 (2000) Sodium-dependent serotonin transporter
Name:Sodium-dependent serotonin transporter
Type:Multi-pass membrane protein
Mol. Mass.:70322.51
Organism:Homo sapiens (Human)
Description:P31645
Residue:630
BDBM50091098
NameBDBM50091098
Synonyms:2-(2-Dimethylaminomethyl-phenylsulfanyl)-5-trifluoromethyl-phenylamine | CHEMBL104673
TypeSmall organic molecule
Emp. Form.C16H17F3N2S
Mol. Mass.326.38
SMILESCN(C)Cc1ccccc1Sc1ccc(cc1N)C(F)(F)F