Reaction Details
TargetHeme oxygenase 2
LigandBDBM50207199
Substrate/Competitorn/a
Meas. Tech.ChEMBL_1930138 (CHEMBL4433389)
IC50>100000±n/a nM
Citation Salerno, LFloresta, GCiaffaglione, VGentile, DMargani, FTurnaturi, RRescifina, APittalą, V Progress in the development of selective heme oxygenase-1 inhibitors and their potential therapeutic application. Eur J Med Chem167:439-453 (2019) 
 
Heme oxygenase 2
Name:Heme oxygenase 2
Type:PROTEIN
Mol. Mass.:36025.41
Organism:Homo sapiens
Description:ChEMBL_11321
Residue:316
BDBM50207199
NameBDBM50207199
Synonyms:1-((2-(2-(4-bromophenyl)ethyl)-1,3-dioxolan-2-yl)methyl)-1H-imidazole hydrochloride | CHEMBL539857
TypeSmall organic molecule
Emp. Form.C15H17BrN2O2
Mol. Mass.337.212
SMILESBrc1ccc(CCC2(Cn3ccnc3)OCCO2)cc1