Reaction Details
TargetTransporter
LigandBDBM50006774
Substrate/Competitorn/a
Meas. Tech.ChEBML_143114
Ki 2.8±n/a nM
Citation Tamagnan, GBaldwin, RMKula, NSBaldessarini, RJInnis, RB Synthesis and monoamine transporter affinity of 2beta-carbomethoxy-3beta-(2''-, 3''- or 4''-substituted) biphenyltropanes. Bioorg Med Chem Lett10:1783-5 (2000) Transporter
Name:Transporter
Type:PROTEIN
Mol. Mass.:66787.87
Organism:Rattus norvegicus
Description:ChEMBL_1463061
Residue:597
BDBM50006774
NameBDBM50006774
Synonyms:(2S,3S)-methyl 3-(4-iodophenyl)-8-methyl-8-aza-bicyclo[3.2.1]octane-2-carboxylate CHEMBL311347 | methyl 3-(4-iodophenyl)-8-methyl-(2S,3S)-8-azabicyclo[3.2.1]octane-2-carboxylate
TypeSmall organic molecule
Emp. Form.C16H20INO2
Mol. Mass.385.24
SMILESCOC(=O)[C@@H]1C2CC[C@H](C[C@@H]1c1ccc(I)cc1)N2C