Reaction Details
TargetProstaglandin F2-alpha receptor
LigandBDBM50091623
Substrate/Competitorn/a
Meas. Tech.ChEMBL_158459 (CHEMBL763263)
Ki 1900±n/a nM
Citation Klimko, PGDavis, TLGriffin, BWSharif, NA Synthesis and biological activity of a novel 11a-homo (cyclohexyl) prostaglandin. J Med Chem43:3400-7 (2000) Prostaglandin F2-alpha receptor
Name:Prostaglandin F2-alpha receptor
Type:Enzyme
Mol. Mass.:40072.29
Organism:Homo sapiens (Human)
Description:P43088
Residue:359
BDBM50091623
NameBDBM50091623
Synonyms:7-{2-[4-(3-Chloro-phenoxy)-3-hydroxy-but-1-enyl]-3,6-dihydroxy-cyclohexyl}-hept-5-enoic acid | CHEMBL323591
TypeSmall organic molecule
Emp. Form.C23H31ClO6
Mol. Mass.438.942
SMILESO[C@@H](COc1cccc(Cl)c1)\C=C\[C@H]1[C@H](O)CC[C@H](O)[C@@H]1C\C=C/CCCC(O)=O