Reaction Details
TargetIntegrin alpha-IIb/beta-3
LigandBDBM50078440
Substrate/Competitorn/a
Meas. Tech.ChEMBL_218217 (CHEMBL824387)
Kd 2.1±n/a nM
Citation Egbertson, MSBednar, BAskew, BCBednar, RABrashear, KBreslin, MJDuggan, MEFisher, TEHalczenko, WHutchinson, JHIhle, NPrugh, JDWai, JSGould, RJHartman, GD Nonpeptide GPIIB/IIIA receptor antagonists. Part 21: C-6 flexibility and amide bond orientation are important factors in determining the affinity of compounds for activated or resting platelet receptors. Bioorg Med Chem Lett10:1943-8 (2001) Integrin alpha-IIb/beta-3
Name:Integrin alpha-IIb/beta-3
Synonyms:Glycoprotein IIb/IIIa
Type:n/a
Mol. Mass.:n/a
Description:ASSAY_ID of EBI is 30109
Components:This complex has 2 components.
Component 1
Name:Integrin beta-3
Type:Protein
Mol. Mass.:87038.91
Organism:Homo sapiens (Human)
Description:P05106
Residue:788
Component 2
Name:Integrin alpha-IIb
Synonyms:CD_antigen=CD41 GPIIb Glycoprotein IIb ITGA2B Integrin alpha-IIb heavy chain Integrin alpha-IIb light chain, form 2 Integrin alpha-V/beta-3 and alpha-IIb/beta 3 | Platelet membrane glycoprotein IIb
Type:Protein
Mol. Mass.:113354.85
Organism:Homo sapiens (Human)
Description:P08514
Residue:1039
BDBM50078440
NameBDBM50078440
Synonyms:(S)-2-Benzenesulfonylamino-3-{[5-(2-piperidin-4-yl-ethyl)-thieno[2,3-b]thiophene-2-carbonyl]-amino}-propionic acid | CHEMBL293601
TypeSmall organic molecule
Emp. Form.C23H27N3O5S3
Mol. Mass.521.673
SMILESOC(=O)[C@H](CNC(=O)c1cc2cc(CCC3CCNCC3)sc2s1)NS(=O)(=O)c1ccccc1