Reaction Details
TargetAtrial natriuretic peptide receptor 3
LigandBDBM50091756
Substrate/Competitorn/a
Meas. Tech.ChEBML_34991
Ki 2900±n/a nM
Citation Veale, CAAlford, VCAharony, DBanville, DLBialecki, RABrown, FJDamewood, JRDantzman, CLEdwards, PDJacobs, RTMauger, RCMurphy, MMPalmer, WPine, KKRumsey, WLGarcia-Davenport, LEShaw, ASteelman, GBSurian, JMVacek, EP The discovery of non-basic atrial natriuretic peptide clearance receptor antagonists. Part 1. Bioorg Med Chem Lett10:1949-52 (2001) Atrial natriuretic peptide receptor 3
Name:Atrial natriuretic peptide receptor 3
Type:PROTEIN
Mol. Mass.:59805.12
Organism:Homo sapiens (Human)
Description:ChEMBL_34991
Residue:541
BDBM50091756
NameBDBM50091756
Synonyms:(S)-3-[(2S,3S)-2-((S)-2-Acetylamino-5-guanidino-pentanoylamino)-3-methyl-pentanoylamino]-N-[(S)-4-guanidino-1-((S)-2-methyl-pentylcarbamoyl)-butyl]-succinamic acid | CHEMBL61413
TypeSmall organic molecule
Emp. Form.C30H57N11O7
Mol. Mass.683.8431
SMILESCCC[C@H](C)CNC(=O)[C@H](CCCNC(N)=N)NC(=O)[C@H](CC(O)=O)NC(=O)[C@@H](NC(=O)[C@H](CCCNC(N)=N)NC(C)=O)[C@@H](C)CC