Reaction Details
TargetAtrial natriuretic peptide receptor 1
LigandBDBM50091761
Substrate/Competitorn/a
Meas. Tech.ChEBML_34995
Ki>10±n/a nM
Citation Veale, CAAlford, VCAharony, DBanville, DLBialecki, RABrown, FJDamewood, JRDantzman, CLEdwards, PDJacobs, RTMauger, RCMurphy, MMPalmer, WPine, KKRumsey, WLGarcia-Davenport, LEShaw, ASteelman, GBSurian, JMVacek, EP The discovery of non-basic atrial natriuretic peptide clearance receptor antagonists. Part 1. Bioorg Med Chem Lett10:1949-52 (2001) Atrial natriuretic peptide receptor 1
Name:Atrial natriuretic peptide receptor 1
Type:PROTEIN
Mol. Mass.:118919.35
Organism:Homo sapiens (Human)
Description:ChEMBL_700223
Residue:1061
BDBM50091761
NameBDBM50091761
Synonyms:(S)-N-[(S)-4-Guanidino-1-((S)-2-methyl-butylcarbamoyl)-butyl]-3-{(2S,3S)-2-[(S)-5-guanidino-2-(2-{4-[(naphthalene-2-carbonyl)-amino]-phenyl}-acetylamino)-pentanoylamino]-3-methyl-pentanoylamino}-succinamic acid | CHEMBL58588
TypeSmall organic molecule
Emp. Form.C46H66N12O8
Mol. Mass.915.0918
SMILESCC[C@H](C)CNC(=O)[C@H](CCCNC(N)=N)NC(=O)[C@H](CC(O)=O)NC(=O)[C@@H](NC(=O)[C@H](CCCNC(N)=N)NC(=O)Cc1ccc(NC(=O)c2ccc3ccccc3c2)cc1)[C@@H](C)CC