Reaction Details
TargetD(2) dopamine receptor
LigandBDBM50092041
Substrate/Competitorn/a
Meas. Tech.ChEBML_60226
Ki>1000±n/a nM
Citation Zhao, HThurkauf, ABraun, JBrodbeck, RKieltyka, A Design, synthesis, and discovery of 3-piperazinyl-3,4-dihydro-2(1H)-quinolinone derivatives: a novel series of mixed dopamine D2/D4 receptor antagonists. Bioorg Med Chem Lett10:2119-22 (2000) D(2) dopamine receptor
Name:D(2) dopamine receptor
Type:Cell-surface receptors
Mol. Mass.:50647.10
Organism:Homo sapiens (Human)
Description:P14416
Residue:443
BDBM50092041
NameBDBM50092041
Synonyms:3-[4-(4-Chloro-benzyl)-piperazin-1-yl]-1,3-diethyl-1,3-dihydro-indol-2-one | CHEMBL304584
TypeSmall organic molecule
Emp. Form.C23H28ClN3O
Mol. Mass.397.941
SMILESCCN1C(=O)C(CC)(N2CCN(Cc3ccc(Cl)cc3)CC2)c2ccccc12