Reaction Details
TargetD(2) dopamine receptor
LigandBDBM50092043
Substrate/Competitorn/a
Meas. Tech.ChEBML_60226
Ki 93±n/a nM
Citation Zhao, HThurkauf, ABraun, JBrodbeck, RKieltyka, A Design, synthesis, and discovery of 3-piperazinyl-3,4-dihydro-2(1H)-quinolinone derivatives: a novel series of mixed dopamine D2/D4 receptor antagonists. Bioorg Med Chem Lett10:2119-22 (2000) D(2) dopamine receptor
Name:D(2) dopamine receptor
Type:Cell-surface receptors
Mol. Mass.:50647.10
Organism:Homo sapiens (Human)
Description:P14416
Residue:443
BDBM50092043
NameBDBM50092043
Synonyms:1-(2,4-Dichloro-phenyl)-4-((1S,2S)-2-phenyl-cyclopropylmethyl)-piperazine CHEMBL302075
TypeSmall organic molecule
Emp. Form.C20H22Cl2N2
Mol. Mass.361.308
SMILESClc1ccc(N2CCN(C[C@H]3C[C@@H]3c3ccccc3)CC2)c(Cl)c1