Reaction Details
TargetD(2) dopamine receptor
LigandBDBM50092039
Substrate/Competitorn/a
Meas. Tech.ChEBML_60226
Ki>1000±n/a nM
Citation Zhao, HThurkauf, ABraun, JBrodbeck, RKieltyka, A Design, synthesis, and discovery of 3-piperazinyl-3,4-dihydro-2(1H)-quinolinone derivatives: a novel series of mixed dopamine D2/D4 receptor antagonists. Bioorg Med Chem Lett10:2119-22 (2000) D(2) dopamine receptor
Name:D(2) dopamine receptor
Type:Cell-surface receptors
Mol. Mass.:50647.10
Organism:Homo sapiens (Human)
Description:P14416
Residue:443
BDBM50092039
NameBDBM50092039
Synonyms:3-[4-(4-Methyl-benzyl)-piperazin-1-yl]-1,3-dihydro-indol-2-one | CHEMBL68190
TypeSmall organic molecule
Emp. Form.C20H23N3O
Mol. Mass.321.4161
SMILESCc1ccc(CN2CCN(CC2)C2C(=O)Nc3ccccc23)cc1