Reaction Details
TargetD(4) dopamine receptor
LigandBDBM50092044
Substrate/Competitorn/a
Meas. Tech.ChEBML_60689
Ki>1000±n/a nM
Citation Zhao, HThurkauf, ABraun, JBrodbeck, RKieltyka, A Design, synthesis, and discovery of 3-piperazinyl-3,4-dihydro-2(1H)-quinolinone derivatives: a novel series of mixed dopamine D2/D4 receptor antagonists. Bioorg Med Chem Lett10:2119-22 (2000) D(4) dopamine receptor
Name:D(4) dopamine receptor
Type:Enzyme
Mol. Mass.:48373.19
Organism:Homo sapiens (Human)
Description:P21917
Residue:419
BDBM50092044
NameBDBM50092044
Synonyms:3-[4-(4-Chloro-benzyl)-piperazin-1-yl]-1,3-dihydro-indol-2-one | CHEMBL305453
TypeSmall organic molecule
Emp. Form.C19H20ClN3O
Mol. Mass.341.835
SMILESClc1ccc(CN2CCN(CC2)C2C(=O)Nc3ccccc23)cc1