Reaction Details
TargetTyrosine-protein kinase Lck
LigandBDBM50092231
Substrate/Competitorn/a
Meas. Tech.ChEMBL_221331 (CHEMBL842023)
IC50<8±n/a nM
Citation Arnold, LDCalderwood, DJDixon, RWJohnston, DNKamens, JSMunschauer, RRafferty, PRatnofsky, SE Pyrrolo[2,3-d]pyrimidines containing an extended 5-substituent as potent and selective inhibitors of lck I. Bioorg Med Chem Lett10:2167-70 (2001) Tyrosine-protein kinase Lck
Name:Tyrosine-protein kinase Lck
Type:n/a
Mol. Mass.:57987.83
Organism:Homo sapiens (Human)
Description:P06239
Residue:509
BDBM50092231
NameBDBM50092231
Synonyms:(4-Phenoxy-phenyl)-quinazolin-4-yl-amine | CHEMBL304760
TypeSmall organic molecule
Emp. Form.C20H15N3O
Mol. Mass.313.3526
SMILESN(c1ccc(Oc2ccccc2)cc1)c1ncnc2ccccc12