Reaction Details
TargetTyrosine-protein kinase Lck
LigandBDBM50092224
Substrate/Competitorn/a
Meas. Tech.ChEMBL_221331 (CHEMBL842023)
IC50<1±n/a nM
Citation Arnold, LDCalderwood, DJDixon, RWJohnston, DNKamens, JSMunschauer, RRafferty, PRatnofsky, SE Pyrrolo[2,3-d]pyrimidines containing an extended 5-substituent as potent and selective inhibitors of lck I. Bioorg Med Chem Lett10:2167-70 (2001) Tyrosine-protein kinase Lck
Name:Tyrosine-protein kinase Lck
Type:n/a
Mol. Mass.:57987.83
Organism:Homo sapiens (Human)
Description:P06239
Residue:509
BDBM50092224
NameBDBM50092224
Synonyms:3-[4-Amino-5-(4-phenoxy-phenyl)-pyrrolo[2,3-d]pyrimidin-7-yl]-cyclopentanol | CHEMBL69129
TypeSmall organic molecule
Emp. Form.C23H22N4O2
Mol. Mass.386.4464
SMILESNc1ncnc2n(cc(-c3ccc(Oc4ccccc4)cc3)c12)C1CCC(O)C1