Reaction Details
TargetMuscarinic acetylcholine receptor M5
LigandBDBM50092313
Substrate/Competitorn/a
Meas. Tech.ChEBML_139395
Ki 1.7±n/a nM
Citation Billard, WBinch, HBratzler, KChen, LYCrosby, GDuffy, RADugar, SLachowicz, JMcQuade, RPushpavanam, PRuperto, VBTaylor, LAClader, JW Diphenylsulfone muscarinic antagonists: piperidine derivatives with high M2 selectivity and improved potency. Bioorg Med Chem Lett10:2209-12 (2001) Muscarinic acetylcholine receptor M5
Name:Muscarinic acetylcholine receptor M5
Type:PROTEIN
Mol. Mass.:60102.35
Organism:Homo sapiens (Human)
Description:ChEMBL_1517990
Residue:532
BDBM50092313
NameBDBM50092313
Synonyms:1-Cyclohexyl-4-{1-[4-(4-methoxy-benzenesulfinyl)-phenyl]-ethyl}-piperidine | CHEMBL71124
TypeSmall organic molecule
Emp. Form.C26H35NO2S
Mol. Mass.425.627
SMILESCOc1ccc(cc1)S(=O)c1ccc(cc1)C(C)C1CCN(CC1)C1CCCCC1