Reaction Details
TargetD(2) dopamine receptor
LigandBDBM50092428
Substrate/Competitorn/a
Meas. Tech.ChEMBL_61577 (CHEMBL675091)
IC50 38±n/a nM
Citation Mayer, PBrunel, PChaplain, CPiedecoq, CCalmel, FSchambel, PChopin, PWurch, TPauwels, PJMarien, MVidaluc, JLImbert, T New substituted 1-(2,3-dihydrobenzo[1, 4]dioxin-2-ylmethyl)piperidin-4-yl derivatives with alpha(2)-adrenoceptor antagonist activity. J Med Chem43:3653-64 (2000) D(2) dopamine receptor
Name:D(2) dopamine receptor
Type:G Protein-Coupled Receptor (GPCR)
Mol. Mass.:50931.60
Organism:Rattus norvegicus (rat)
Description:P61169
Residue:444
BDBM50092428
NameBDBM50092428
Synonyms:1-{2-[1-(2,3-Dihydro-benzo[1,4]dioxin-2-ylmethyl)-piperidin-4-yl]-ethyl}-3-phenyl-tetrahydro-pyrimidin-2-one | CHEMBL123139
TypeSmall organic molecule
Emp. Form.C26H33N3O3
Mol. Mass.435.5585
SMILESO=C1N(CCC2CCN(CC3COc4ccccc4O3)CC2)CCCN1c1ccccc1