Reaction Details
TargetD(2) dopamine receptor
LigandBDBM50092448
Substrate/Competitorn/a
Meas. Tech.ChEMBL_61577 (CHEMBL675091)
IC50 26±n/a nM
Citation Mayer, PBrunel, PChaplain, CPiedecoq, CCalmel, FSchambel, PChopin, PWurch, TPauwels, PJMarien, MVidaluc, JLImbert, T New substituted 1-(2,3-dihydrobenzo[1, 4]dioxin-2-ylmethyl)piperidin-4-yl derivatives with alpha(2)-adrenoceptor antagonist activity. J Med Chem43:3653-64 (2000) D(2) dopamine receptor
Name:D(2) dopamine receptor
Type:G Protein-Coupled Receptor (GPCR)
Mol. Mass.:50931.60
Organism:Rattus norvegicus (rat)
Description:P61169
Residue:444
BDBM50092448
NameBDBM50092448
Synonyms:CHEMBL331327 | Phenyl-carbamic acid 2-[1-(2,3-dihydro-benzo[1,4]dioxin-2-ylmethyl)-piperidin-4-yl]-ethyl ester
TypeSmall organic molecule
Emp. Form.C23H28N2O4
Mol. Mass.396.4794
SMILESO=C(Nc1ccccc1)OCCC1CCN(CC2COc3ccccc3O2)CC1