Reaction Details
TargetD(2) dopamine receptor
LigandBDBM50092455
Substrate/Competitorn/a
Meas. Tech.ChEMBL_61577 (CHEMBL675091)
IC50 1.4±n/a nM
Citation Mayer, PBrunel, PChaplain, CPiedecoq, CCalmel, FSchambel, PChopin, PWurch, TPauwels, PJMarien, MVidaluc, JLImbert, T New substituted 1-(2,3-dihydrobenzo[1, 4]dioxin-2-ylmethyl)piperidin-4-yl derivatives with alpha(2)-adrenoceptor antagonist activity. J Med Chem43:3653-64 (2000) D(2) dopamine receptor
Name:D(2) dopamine receptor
Type:G Protein-Coupled Receptor (GPCR)
Mol. Mass.:50931.60
Organism:Rattus norvegicus (rat)
Description:P61169
Residue:444
BDBM50092455
NameBDBM50092455
Synonyms:1-{2-[1-(2,3-Dihydro-benzo[1,4]dioxin-2-ylmethyl)-piperidin-4-yl]-ethyl}-3-pyridin-4-yl-imidazolidin-2-one | CHEMBL121675
TypeSmall organic molecule
Emp. Form.C24H30N4O3
Mol. Mass.422.52
SMILESO=C1N(CCC2CCN(CC3COc4ccccc4O3)CC2)CCN1c1ccncc1