Reaction Details
Target5-hydroxytryptamine receptor 4
LigandBDBM50092564
Substrate/Competitorn/a
Meas. Tech.ChEMBL_3573 (CHEMBL620706)
Ki>1000±n/a nM
Citation Curtet, SSoulier, JLZahradnik, IGiner, MBerque-Bestel, IMialet, JLezoualc'h, FDonzeau-Gouge, PSicsic, SFischmeister, RLanglois, M New arylpiperazine derivatives as antagonists of the human cloned 5-HT(4) receptor isoforms. J Med Chem43:3761-9 (2000) 5-hydroxytryptamine receptor 4
Name:5-hydroxytryptamine receptor 4
Type:Enzyme
Mol. Mass.:43767.54
Organism:Homo sapiens (Human)
Description:Q13639
Residue:388
BDBM50092564
NameBDBM50092564
Synonyms:4-Amino-5-chloro-2-methoxy-benzoic acid 2-(4-methyl-piperazin-1-yl)-ethyl ester | CHEMBL338136
TypeSmall organic molecule
Emp. Form.C15H22ClN3O3
Mol. Mass.327.806
SMILESCOc1cc(N)c(Cl)cc1C(=O)OCCN1CCN(C)CC1