Reaction Details
Target5-hydroxytryptamine receptor 4
LigandBDBM50056393
Substrate/Competitorn/a
Meas. Tech.ChEMBL_3568 (CHEMBL875082)
Ki 55±n/a nM
Citation Curtet, SSoulier, JLZahradnik, IGiner, MBerque-Bestel, IMialet, JLezoualc'h, FDonzeau-Gouge, PSicsic, SFischmeister, RLanglois, M New arylpiperazine derivatives as antagonists of the human cloned 5-HT(4) receptor isoforms. J Med Chem43:3761-9 (2000) 5-hydroxytryptamine receptor 4
Name:5-hydroxytryptamine receptor 4
Type:Enzyme
Mol. Mass.:43767.54
Organism:Homo sapiens (Human)
Description:Q13639
Residue:388
BDBM50056393
NameBDBM50056393
Synonyms:4-Amino-5-chloro-2-methoxy-benzoic acid 2-(4-phenyl-piperazin-1-yl)-ethyl ester | CHEMBL123377
TypeSmall organic molecule
Emp. Form.C20H24ClN3O3
Mol. Mass.389.876
SMILESCOc1cc(N)c(Cl)cc1C(=O)OCCN1CCN(CC1)c1ccccc1