Reaction Details
TargetCannabinoid receptor 1
LigandBDBM50061113
Substrate/Competitorn/a
Meas. Tech.ChEMBL_46466 (CHEMBL657913)
Ki 2±n/a nM
Citation Mahadevan, ASiegel, CMartin, BRAbood, MEBeletskaya, IRazdan, RK Novel cannabinol probes for CB1 and CB2 cannabinoid receptors. J Med Chem43:3778-85 (2000) Cannabinoid receptor 1
Name:Cannabinoid receptor 1
Type:G Protein-Coupled Receptor (GPCR)
Mol. Mass.:52868.96
Organism:Homo sapiens (Human)
Description:P21554
Residue:472
BDBM50061113
NameBDBM50061113
Synonyms:3-(1',1'-dimethylheptyl)-6,6,9-trimethyl-6H-benzo[c]chromene-1-ol CHEMBL109393
TypeSmall organic molecule
Emp. Form.C25H34O2
Mol. Mass.366.5363
SMILESCCCCCCC(C)(C)c1cc(O)c-2c(OC(C)(C)c3ccc(C)cc-23)c1