Reaction Details
TargetCannabinoid receptor 1
LigandBDBM50092585
Substrate/Competitorn/a
Meas. Tech.ChEMBL_46458 (CHEMBL657905)
Ki 875±n/a nM
Citation Mahadevan, ASiegel, CMartin, BRAbood, MEBeletskaya, IRazdan, RK Novel cannabinol probes for CB1 and CB2 cannabinoid receptors. J Med Chem43:3778-85 (2000) Cannabinoid receptor 1
Name:Cannabinoid receptor 1
Type:G Protein-Coupled Receptor (GPCR)
Mol. Mass.:52868.96
Organism:Homo sapiens (Human)
Description:P21554
Residue:472
BDBM50092585
NameBDBM50092585
Synonyms:4-(1,1-Dimethyl-butyl)-2'-isopropyl-5'-methyl-biphenyl-2-ol | CHEMBL125010
TypeSmall organic molecule
Emp. Form.C22H30O
Mol. Mass.310.473
SMILESCCCC(C)(C)c1ccc(c(O)c1)-c1cc(C)ccc1C(C)C