Reaction Details
TargetCannabinoid receptor 1
LigandBDBM50092582
Substrate/Competitorn/a
Meas. Tech.ChEMBL_46458 (CHEMBL657905)
Ki 204±n/a nM
Citation Mahadevan, ASiegel, CMartin, BRAbood, MEBeletskaya, IRazdan, RK Novel cannabinol probes for CB1 and CB2 cannabinoid receptors. J Med Chem43:3778-85 (2000) Cannabinoid receptor 1
Name:Cannabinoid receptor 1
Type:G Protein-Coupled Receptor (GPCR)
Mol. Mass.:52868.96
Organism:Homo sapiens (Human)
Description:P21554
Residue:472
BDBM50092582
NameBDBM50092582
Synonyms:CHEMBL127919 | [3-(1,1-Dimethyl-butyl)-6,6-dimethyl-6H-benzo[c]chromen-9-yl]-methanol
TypeSmall organic molecule
Emp. Form.C22H28O2
Mol. Mass.324.4565
SMILESCCCC(C)(C)c1ccc-2c(OC(C)(C)c3ccc(CO)cc-23)c1