Reaction Details
TargetCannabinoid receptor 2
LigandBDBM50092594
Substrate/Competitorn/a
Meas. Tech.ChEMBL_46990 (CHEMBL658959)
Ki 286±n/a nM
Citation Mahadevan, ASiegel, CMartin, BRAbood, MEBeletskaya, IRazdan, RK Novel cannabinol probes for CB1 and CB2 cannabinoid receptors. J Med Chem43:3778-85 (2000) Cannabinoid receptor 2
Name:Cannabinoid receptor 2
Type:G Protein-Coupled Receptor (GPCR)
Mol. Mass.:39690.94
Organism:Homo sapiens (Human)
Description:P34972
Residue:360
BDBM50092594
NameBDBM50092594
Synonyms:3-(1,1-Dimethyl-heptyl)-1-methoxy-6,6,9-trimethyl-6H-benzo[c]chromene | CHEMBL124649
TypeSmall organic molecule
Emp. Form.C26H36O2
Mol. Mass.380.5628
SMILESCCCCCCC(C)(C)c1cc(OC)c-2c(OC(C)(C)c3ccc(C)cc-23)c1