Reaction Details
Target5-hydroxytryptamine receptor 6
LigandBDBM50093047
Substrate/Competitorn/a
Meas. Tech.ChEBML_3621
Ki 7.4±n/a nM
Citation Tsai, YDukat, MSlassi, AMacLean, NDemchyshyn, LSavage, JERoth, BLHufesein, SLee, MGlennon, RA N1-(Benzenesulfonyl)tryptamines as novel 5-HT6 antagonists. Bioorg Med Chem Lett10:2295-9 (2001) 5-hydroxytryptamine receptor 6
Name:5-hydroxytryptamine receptor 6
Type:G Protein-Coupled Receptor (GPCR)
Mol. Mass.:46968.43
Organism:Homo sapiens (Human)
Description:P50406
Residue:440
BDBM50093047
NameBDBM50093047
Synonyms:CHEMBL75758 | {2-[1-(2,5-Dimethoxy-benzenesulfonyl)-4-methoxy-1H-indol-3-yl]-ethyl}-dimethyl-amine
TypeSmall organic molecule
Emp. Form.C21H26N2O5S
Mol. Mass.418.507
SMILESCOc1ccc(OC)c(c1)S(=O)(=O)n1cc(CCN(C)C)c2c(OC)cccc12