Reaction Details
TargetAlpha-1A adrenergic receptor
LigandBDBM50093213
Substrate/Competitorn/a
Meas. Tech.ChEBML_33728
Ki 3.7±n/a nM
Citation Li, XMcCoy, KAMurray, WVJolliffe, LPulito, V Novel heterocycles as selective alpha1-adrenergic receptor antagonists. Bioorg Med Chem Lett10:2375-7 (2001) Alpha-1A adrenergic receptor
Name:Alpha-1A adrenergic receptor
Type:Cell-surface receptors
Mol. Mass.:51511.67
Organism:Homo sapiens (Human)
Description:P35348
Residue:466
BDBM50093213
NameBDBM50093213
Synonyms:1-{5-[4-(2-Isopropoxy-phenyl)-piperazin-1-ylmethyl]-2-methyl-2H-pyrazol-3-ylmethyl}-piperidin-2-one | CHEMBL440499
TypeSmall organic molecule
Emp. Form.C24H35N5O2
Mol. Mass.425.567
SMILESCC(C)Oc1ccccc1N1CCN(Cc2cc(CN3CCCCC3=O)n(C)n2)CC1