Reaction Details
TargetMelatonin receptor type 1A
LigandBDBM50093263
Substrate/Competitorn/a
Meas. Tech.ChEMBL_104944 (CHEMBL713111)
Ki 0.026±n/a nM
Citation Jellimann, CMathé-Allainmat, MAndrieux, JKloubert, SBoutin, JANicolas, JPBennejean, CDelagrange, PLanglois, M Synthesis of phenalene and acenaphthene derivatives as new conformationally restricted ligands for melatonin receptors. J Med Chem43:4051-62 (2000) Melatonin receptor type 1A
Name:Melatonin receptor type 1A
Type:Enzyme
Mol. Mass.:39392.94
Organism:Homo sapiens (Human)
Description:P48039
Residue:350
BDBM50093263
NameBDBM50093263
Synonyms:CHEMBL133416 | Cyclopropanecarboxylic acid (4,9-dimethoxy-2,3-dihydro-1H-phenalen-1-ylmethyl)-amide
TypeSmall organic molecule
Emp. Form.C20H23NO3
Mol. Mass.325.4015
SMILESCOc1ccc2ccc(OC)c3C(CNC(=O)C4CC4)CCc1c23