Reaction Details
TargetPoly [ADP-ribose] polymerase 1
LigandBDBM50093374
Substrate/Competitorn/a
Meas. Tech.ChEMBL_151867 (CHEMBL759581)
Ki 6±n/a nM
Citation White, AWAlmassy, RCalvert, AHCurtin, NJGriffin, RJHostomsky, ZMaegley, KNewell, DRSrinivasan, SGolding, BT Resistance-modifying agents. 9. Synthesis and biological properties of benzimidazole inhibitors of the DNA repair enzyme poly(ADP-ribose) polymerase. J Med Chem43:4084-97 (2000) Poly [ADP-ribose] polymerase 1
Name:Poly [ADP-ribose] polymerase 1
Type:n/a
Mol. Mass.:113114.22
Organism:Homo sapiens (Human)
Description:P09874
Residue:1014
BDBM50093374
NameBDBM50093374
Synonyms:2-(4-Hydroxy-phenyl)-1H-benzoimidazole-4-carboxylic acid amide | CHEMBL131719
TypeSmall organic molecule
Emp. Form.C14H11N3O2
Mol. Mass.253.256
SMILESNC(=O)c1cccc2nc([nH]c12)-c1ccc(O)cc1