Reaction Details
TargetPoly [ADP-ribose] polymerase 1
LigandBDBM50093377
Substrate/Competitorn/a
Meas. Tech.ChEMBL_151873 (CHEMBL763797)
Ki 8±n/a nM
Citation White, AWAlmassy, RCalvert, AHCurtin, NJGriffin, RJHostomsky, ZMaegley, KNewell, DRSrinivasan, SGolding, BT Resistance-modifying agents. 9. Synthesis and biological properties of benzimidazole inhibitors of the DNA repair enzyme poly(ADP-ribose) polymerase. J Med Chem43:4084-97 (2000) Poly [ADP-ribose] polymerase 1
Name:Poly [ADP-ribose] polymerase 1
Type:n/a
Mol. Mass.:113114.22
Organism:Homo sapiens (Human)
Description:P09874
Residue:1014
BDBM50093377
NameBDBM50093377
Synonyms:2-(4-Nitro-phenyl)-1H-benzoimidazole-4-carboxylic acid amide | CHEMBL339167
TypeSmall organic molecule
Emp. Form.C14H10N4O3
Mol. Mass.282.2542
SMILESNC(=O)c1cccc2[nH]c(nc12)-c1ccc(cc1)[N+]([O-])=O