Reaction Details
TargetAldo-keto reductase family 1 member B1
LigandBDBM50317425
Substrate/Competitorn/a
Meas. Tech.ChEMBL_1970364 (CHEMBL4603182)
IC50 126000±n/a nM
Citation Tomohara, KHasegawa, NAdachi, IHorino, YNose, T Early identification of promiscuous attributes of aldose reductase inhibitors using a DMSO-perturbation assay. Bioorg Med Chem Lett30:0 (2020) 
 
Aldo-keto reductase family 1 member B1
Name:Aldo-keto reductase family 1 member B1
Type:Protein
Mol. Mass.:35855.50
Organism:Homo sapiens (Human)
Description:P15121. 4LAU; 2IKI; 4LB4; 2FZD; 2FZ8; 1US0
Residue:316
BDBM50317425
NameBDBM50317425
Synonyms:10-Gingerol | CHEMBL549472
TypeSmall organic molecule
Emp. Form.C21H34O4
Mol. Mass.350.4923
SMILESCCCCCCCCC[C@H](O)CC(=O)CCc1ccc(O)c(OC)c1